Displaying #maven-dev/2017-04-02.log:

Sun Apr 2 07:57:51 2017  Michael-O:Joined the channel
Sun Apr 2 10:08:20 2017  khmarbaise:Joined the channel
Sun Apr 2 12:15:30 2017  tibor_:Joined the channel
Sun Apr 2 12:43:49 2017  olamy:Joined the channel
Sun Apr 2 14:51:05 2017  khmarbaise:Joined the channel
Sun Apr 2 15:35:09 2017  tibor_:Joined the channel
Sun Apr 2 15:39:41 2017  tibor_:Michael-O: Hi Michael.
Sun Apr 2 15:39:45 2017  tibor_:What's up
Sun Apr 2 15:40:12 2017  Michael-O:Hi, I was able to narrow down the issue
Sun Apr 2 15:40:25 2017  Michael-O:It happens only in embedded profile of the IT suite
Sun Apr 2 15:40:49 2017  Michael-O:I have uploaded several branches to have separate tests
Sun Apr 2 15:41:47 2017  Michael-O:In same cases even SUREFIRE-859 appears and drowns the entire VM to death
Sun Apr 2 15:41:56 2017  Michael-O:ZipEntry issue in native code
Sun Apr 2 15:43:19 2017  tibor_:What branch of mvn-its would you to recommend to test with surefire?
Sun Apr 2 15:44:35 2017  tibor_:In SUREFIRE-859 you mean that the verbose:gc goes to native stdout in the fork?
Sun Apr 2 15:44:54 2017  Michael-O:I am doing this already. Try all-updated and not-updated-MJAR-MCOMPILER
Sun Apr 2 15:45:11 2017  Michael-O:one pass was positive, I am running the second branch now
Sun Apr 2 15:48:37 2017  Michael-O:Case 5640, BuildError. The forked VM crashes with a segmentation fault. SUREFIRE-859 is also prepended to the output
Sun Apr 2 15:48:50 2017  Michael-O:It happens after several runs on the repo
Sun Apr 2 15:50:15 2017  Michael-O:Besides the crash, I have these issues on Windows:
Sun Apr 2 15:50:16 2017  Michael-O:MJAR:
Sun Apr 2 15:50:16 2017  Michael-O:Failed tests:
Sun Apr 2 15:50:16 2017  Michael-O: MavenITmng5640LifecycleParticipantAfterSessionEnd>AbstractMavenIntegrationTestCase.runTest:222->testBuildError:154 Expected file was not found: D:\Entwicklung\Projekte\maven-integration-testing\core-it-suite\target\test-classes\mng-5640-lifecycleParticipant-afterSession\builderror-mojoex\target\afterProjectsRead.txt
Sun Apr 2 15:50:16 2017  Michael-O: MavenITmng5640LifecycleParticipantAfterSessionEnd>AbstractMavenIntegrationTestCase.runTest:222->testBuildErrorRt:199 Expected file was not found: D:\Entwicklung\Projekte\maven-integration-testing\core-it-suite\target\test-classes\mng-5640-lifecycleParticipant-afterSession\builderror-runtimeex\target\afterProjectsRead.txt
Sun Apr 2 15:50:20 2017  Michael-O: MavenITmng5640LifecycleParticipantAfterSessionEnd>AbstractMavenIntegrationTestCase.runTest:222->testBuildFailureMissingDependency:109 Expected file was not found: D:\Entwicklung\Projekte\maven-integration-testing\core-it-suite\target\test-classes\mng-5640-lifecycleParticipant-afterSession\buildfailure-depmissing\target\afterProjectsRead.txt
Sun Apr 2 15:50:24 2017  Michael-O:Tests in error:
Sun Apr 2 15:50:28 2017  Michael-O: MavenITmng5578SessionScopeTest>AbstractMavenIntegrationTestCase.runTest:222->testBasic:52 ╗ Verification
Sun Apr 2 15:50:31 2017  Michael-O: MavenITmng5578SessionScopeTest>AbstractMavenIntegrationTestCase.runTest:222->testBasic_buildExtension:99 ╗ Verification
Sun Apr 2 15:50:34 2017  Michael-O:
Sun Apr 2 15:50:36 2017  Michael-O:MCOMPILER:
Sun Apr 2 15:50:38 2017  Michael-O:Failed tests:
Sun Apr 2 15:50:40 2017  Michael-O: MavenITmng5640LifecycleParticipantAfterSessionEnd>AbstractMavenIntegrationTestCase.runTest:222->testBuildError:154 Expected file was not found: D:\Entwicklung\Projekte\maven-integration-testing\core-it-suite\target\test-classes\mng-5640-lifecycleParticipant-afterSession\builderror-mojoex\target\afterProjectsRead.txt
Sun Apr 2 15:50:44 2017  Michael-O:Both:
Sun Apr 2 15:50:46 2017  Michael-O:Failed tests:
Sun Apr 2 15:50:48 2017  Michael-O: MavenITmng5640LifecycleParticipantAfterSessionEnd>AbstractMavenIntegrationTestCase.runTest:222->testBuildErrorRt:199 Expected file was not found: D:\Entwicklung\Projekte\maven-integration-testing\core-it-suite\target\test-classes\mng-5640-lifecycleParticipant-afterSession\builderror-runtimeex\target\afterProjectsRead.txt
Sun Apr 2 15:50:52 2017  Michael-O: MavenITmng5640LifecycleParticipantAfterSessionEnd>AbstractMavenIntegrationTestCase.runTest:222->testBuildFailureMissingDependency:109 Expected file was not found: D:\Entwicklung\Projekte\maven-integration-testing\core-it-suite\target\test-classes\mng-5640-lifecycleParticipant-afterSession\buildfailure-depmissing\target\afterProjectsRead.txt
Sun Apr 2 15:50:58 2017  Michael-O: MavenITmng5640LifecycleParticipantAfterSessionEnd>AbstractMavenIntegrationTestCase.runTest:222->testBuildFailureUTFail:71 Expected file was not found: D:\Entwicklung\Projekte\maven-integration-testing\core-it-suite\target\test-classes\mng-5640-lifecycleParticipant-afterSession\buildfailure-utfail\target\afterProjectsRead.txt
Sun Apr 2 15:51:02 2017  Michael-O:Tests in error:
Sun Apr 2 15:51:04 2017  Michael-O: MavenITmng5578SessionScopeTest>AbstractMavenIntegrationTestCase.runTest:222->testBasic_buildExtension:99 ╗ Verification
Sun Apr 2 15:51:07 2017  Michael-O: MavenITmng5578SessionScopeTest>AbstractMavenIntegrationTestCase.runTest:222->testBasic_multithreaded:76 ╗ Verification
Sun Apr 2 15:59:12 2017  Michael-O:tibor_, I have the crash again
Sun Apr 2 15:59:20 2017  Michael-O:~/apache-maven-3.5.0-MNG-6169-updated-MJAR/bin/mvn clean install -Prun-its,embedded -Dmaven.repo.local=`pwd`/repo2
Sun Apr 2 15:59:32 2017  Michael-O:mng5640LifecycleParticipantAfterSessionEnd(BuildFailureMissingDependency)#
Sun Apr 2 15:59:32 2017  Michael-O:# A fatal error has been detected by the Java Runtime Environment:
Sun Apr 2 15:59:32 2017  Michael-O:#
Sun Apr 2 15:59:32 2017  Michael-O:SUREFIRE-859: # SIGSEGV (0xb) at pc=0x0000000800fae656, pid=91986, tid=0x0000000000018aa7
Sun Apr 2 15:59:32 2017  Michael-O:#
Sun Apr 2 15:59:32 2017  Michael-O:# JRE version: OpenJDK Runtime Environment (8.0_121-b13) (build 1.8.0_121-b13)
Sun Apr 2 15:59:34 2017  Michael-O:# Java VM: OpenJDK 64-Bit Server VM (25.121-b13 mixed mode bsd-amd64 compressed oops)
Sun Apr 2 15:59:36 2017  Michael-O:# Problematic frame:
Sun Apr 2 15:59:38 2017  Michael-O:# C [libc.so.7+0x147656] unsigned long+0x16
Sun Apr 2 15:59:40 2017  Michael-O:#
Sun Apr 2 15:59:42 2017  Michael-O:# Core dump written. Default location: /usr/home/mosipov/Projekte/maven-integration-testing/core-it-suite/java.core
Sun Apr 2 15:59:44 2017  tibor_:but I still do not see the branch all-updated, or not sure
Sun Apr 2 15:59:45 2017  Michael-O:#
Sun Apr 2 15:59:47 2017  Michael-O:# An error report file with more information is saved as:
Sun Apr 2 15:59:49 2017  Michael-O:# /usr/home/mosipov/Projekte/maven-integration-testing/core-it-suite/hs_err_pid91986.log
Sun Apr 2 15:59:51 2017  Michael-O:Compiled method (nm) 116314 441 n 0 java.util.zip.ZipFile::getEntry (native)
Sun Apr 2 15:59:53 2017  Michael-O:SUREFIRE-859: total in heap [0x000000080402ab50,0x000000080402aed0] = 896
Sun Apr 2 15:59:57 2017  Michael-O:SUREFIRE-859: relocation [0x000000080402ac78,0x000000080402acb8] = 64
Sun Apr 2 15:59:59 2017  Michael-O:SUREFIRE-859: main code [0x000000080402acc0,0x000000080402aed0] = 528
Sun Apr 2 16:00:01 2017  Michael-O:#
Sun Apr 2 16:00:03 2017  Michael-O:SUREFIRE-859: # If you would like to submit a bug report, please visit:
Sun Apr 2 16:00:05 2017  Michael-O:# http://bugreport.java.com/bugreport/crash.jsp
Sun Apr 2 16:00:07 2017  Michael-O:#
Sun Apr 2 16:00:09 2017  Michael-O:[ERROR] Failed to execute goal org.apache.maven.plugins:maven-surefire-plugin:2.18.1:test (default-test) on project core-it-suite: Execution default-test of goal org.apache.maven.plugins:maven-surefire-plugin:2.18.1:test failed: The forked VM terminated without properly saying goodbye. VM crash or System.exit called?
Sun Apr 2 16:00:13 2017  Michael-O:[ERROR] Command was /bin/sh -c cd /usr/home/mosipov/Projekte/maven-integration-testing/core-it-suite && /usr/local/openjdk8/jre/bin/java -Xmx384m -Dcom.sun.management.jmxremote=true org.apache.maven.surefire.booter.ForkedBooter /usr/home/mosipov/Projekte/maven-integration-testing/core-it-suite/target/surefire/surefire8931490935904397230tmp /usr/home/mosipov/Projekte/maven-integration-testing/core-it-suite/target/surefire/surefire_38
Sun Apr 2 16:00:18 2017  Michael-O:18964198792551792tmp
Sun Apr 2 16:00:20 2017  Michael-O:did you pull?
Sun Apr 2 16:00:22 2017  Michael-O:Branch MNG-6169/all-updated
Sun Apr 2 16:00:25 2017  tibor_:maven-surefire-plugin:2.18.1
Sun Apr 2 16:00:34 2017  tibor_:change it to 2.20-snapshot
Sun Apr 2 16:01:00 2017  Michael-O:It is not the plugin in my opion becuase it does not fail with previous MJAR version
Sun Apr 2 16:01:09 2017  tibor_:now it should only print the stream but not to fail
Sun Apr 2 16:01:27 2017  Michael-O:I, hold on. I will retry.
Sun Apr 2 16:01:30 2017  tibor_:this is segfault
Sun Apr 2 16:01:34 2017  tibor_:JVM
Sun Apr 2 16:01:43 2017  Michael-O:Right, but what is causing the fault?
Sun Apr 2 16:01:48 2017  Michael-O:Is it expected?
Sun Apr 2 16:01:56 2017  tibor_:of course not
Sun Apr 2 16:01:58 2017  tibor_:but
Sun Apr 2 16:02:16 2017  tibor_:you can I think see some file named like
Sun Apr 2 16:02:24 2017  tibor_:*.vm, wait..
Sun Apr 2 16:03:34 2017  tibor_:java produces dump file
Sun Apr 2 16:03:43 2017  tibor_:hm_* something
Sun Apr 2 16:04:46 2017  tibor_:hs_err_pidXXXX.log
Sun Apr 2 16:06:49 2017  tibor_: /usr/home/mosipov/Projekte/maven-integration-testing/core-it-suite/hs_err_pid91986.log
Sun Apr 2 16:06:52 2017  Michael-O:[error occurred during error reporting (printing register info), id 0xb]
Sun Apr 2 16:06:52 2017  Michael-O:Stack: [0x00007fffdfefe000,0x00007fffdfffe000], sp=0x00007fffdfffa4c8, free space=1009k
Sun Apr 2 16:06:52 2017  Michael-O:Native frames: (J=compiled Java code, j=interpreted, Vv=VM code, C=native code)
Sun Apr 2 16:06:52 2017  Michael-O:C [libc.so.7+0x147656] unsigned long+0x16
Sun Apr 2 16:06:52 2017  Michael-O:C [libzip.so+0x51d3] ZIP_GetEntry+0x173
Sun Apr 2 16:06:53 2017  Michael-O:C [libzip.so+0x367c] Java_java_util_zip_ZipFile_getEntry+0x9c
Sun Apr 2 16:06:57 2017  Michael-O:J 441 java.util.zip.ZipFile.getEntry(J[BZ)J (0 bytes) @ 0x000000080402ada6 [0x000000080402acc0+0xe6]
Sun Apr 2 16:06:59 2017  Michael-O:J 3326 C2 java.util.jar.JarFile.getEntry(Ljava/lang/String;)Ljava/util/zip/ZipEntry; (22 bytes) @ 0x00000008048b5310 [0x00000008048b4fa0+0x370]
Sun Apr 2 16:07:02 2017  Michael-O:J 10414 C2 sun.net.www.protocol.jar.JarURLConnection.getInputStream()Ljava/io/InputStream; (97 bytes) @ 0x0000000805778f7c [0x0000000805778980+0x5fc]
Sun Apr 2 16:07:05 2017  Michael-O:J 9732 C1 org.eclipse.sisu.space.SpaceScanner.accept(Lorg/eclipse/sisu/space/ClassVisitor;Ljava/net/URL;)V (57 bytes) @ 0x0000000804e2f49c [0x0000000804e2f0e0+0x3bc]
Sun Apr 2 16:07:08 2017  Michael-O:J 9730 C1 org.eclipse.sisu.space.SpaceScanner.accept(Lorg/eclipse/sisu/space/SpaceVisitor;)V (73 bytes) @ 0x0000000804faa6bc [0x0000000804faa180+0x53c]
Sun Apr 2 16:07:11 2017  Michael-O:J 10747 C1 org.eclipse.sisu.space.SpaceModule.configure(Lcom/google/inject/Binder;)V (45 bytes) @ 0x00000008059e295c [0x00000008059e2360+0x5fc]
Sun Apr 2 16:07:14 2017  Michael-O:J 10746 C1 org.eclipse.sisu.plexus.PlexusAnnotatedBeanModule.configure(Lcom/google/inject/Binder;)Lorg/eclipse/sisu/plexus/PlexusBeanSource; (22 bytes) @ 0x0000000804df2984 [0x0000000804df2800+0x184]
Sun Apr 2 16:07:17 2017  Michael-O:top of execution stack
Sun Apr 2 16:07:58 2017  tibor_:Guillaume found two crashes of OpenJdk on Win and Freebsd
Sun Apr 2 16:08:17 2017  tibor_:try to use oracle's jdk instead
Sun Apr 2 16:09:29 2017  tibor_:I see JarFile
Sun Apr 2 16:09:43 2017  tibor_:Caller is Sisu?
Sun Apr 2 16:09:49 2017  Michael-O:Yes, Sisu
Sun Apr 2 16:10:06 2017  tibor_:Maven core? In embedded mode?
Sun Apr 2 16:10:12 2017  Michael-O:embedded mode
Sun Apr 2 16:10:52 2017  tibor_:do you see url of zip file in this log?
Sun Apr 2 16:11:01 2017  tibor_:maybe it is corrupted
Sun Apr 2 16:11:23 2017  tibor_:or handler file
Sun Apr 2 16:12:15 2017  Michael-O:Nope, the URL isn't printed: J 9732 C1 org.eclipse.sisu.space.SpaceScanner.accept(Lorg/eclipse/sisu/space/ClassVisitor;Ljava/net/URL;)V
Sun Apr 2 16:12:18 2017  Michael-O:but I have this:
Sun Apr 2 16:12:44 2017  Michael-O: /home/mosipov/Projekte/maven-integration-testing/repo2/org/apache/maven/surefire/surefire-booter/2.18.1/surefire-booter-2.18.1.jar:/home/mosipov/Projekte/maven-integration-testing/repo2/org/apache/maven/surefire/surefire-api/2.18.1/surefire-api-2.18.1.jar:/usr/home/mosipov/Projekte/maven-integration-testing/core-it-suite/target/test-classes:/usr/home/mosipov/Projekte/maven-integration-testing/core-it-suite/target/classes:/home/mosi
Sun Apr 2 16:12:44 2017  Michael-O:pov/Projekte/maven-integration-testing/repo2/junit/junit/4.8.2/junit-4.8.2.jar:/home/mosipov/Projekte/maven-integration-testing/repo2/org/codehaus/plexus/plexus-utils/1.5.8/plexus-utils-1.5.8.jar:/usr/home/mosipov/Projekte/maven-integration-testing/core-it-support/maven-it-helper/target/maven-it-helper-2.1-SNAPSHOT.jar:/home/mosipov/Projekte/maven-integration-testing/repo2/org/apache/maven/maven-artifact/2.0.5/maven-artifact-2.0.5.j
Sun Apr 2 16:12:45 2017  Michael-O:ar:/home/mosipov/Projekte/maven-integration-testing/repo2/org/apache/maven/shared/maven-verifier/1.6/maven-verifier-1.6.jar:/home/mosipov/Projekte/maven-integration-testing/repo2/org/mortbay/jetty/jetty/6.1.14/jetty-6.1.14.jar:/home/mosipov/Projekte/maven-integration-testing/repo2/org/mortbay/jetty/jetty-util/6.1.14/jetty-util-6.1.14.jar:/home/mosipov/Projekte/maven-integration-testing/repo2/org/apache/maven/shared/maven-shared-util
Sun Apr 2 16:12:50 2017  Michael-O:s/0.9/maven-shared-utils-0.9.jar:/home/mosipov/Projekte/maven-integration-testing/repo2/com/google/code/findbugs/jsr305/2.0.1/jsr305-2.0.1.jar:/home/mosipov/Projekte/maven-integration-testing/repo2/org/eclipse/jetty/jetty-server/9.0.4.v20130625/jetty-server-9.0.4.v20130625.jar:/home/mosipov/Projekte/maven-integration-testing/repo2/org/eclipse/jetty/jetty-http/9.0.4.v20130625/jetty-http-9.0.4.v20130625.jar:/home/mosipov/Projekte/mave
Sun Apr 2 16:12:57 2017  Michael-O:n-integration-testing/repo2/org/eclipse/jetty/jetty-io/9.0.4.v20130625/jetty-io-9.0.4.v20130625.jar:/home/mosipov/Projekte/maven-integration-testing/repo2/org/eclipse/jetty/jetty-security/9.0.4.v20130625/jetty-security-9.0.4.v20
Sun Apr 2 16:13:33 2017  tibor_:classpath from where?
Sun Apr 2 16:14:16 2017  Michael-O:Yep, but incomplete.
Sun Apr 2 16:15:19 2017  tibor_:Where did you find it?
Sun Apr 2 16:16:08 2017  tibor_:in target/surefire/*.jar ? In manifest?
Sun Apr 2 16:16:54 2017  Michael-O:In the dump file of the VM
Sun Apr 2 16:16:55 2017  Michael-O:hs_*
Sun Apr 2 16:20:30 2017  tibor_:The ideal would be to grap the manifest from jar file. The ITs run quite long so it should be possible.
Sun Apr 2 16:20:51 2017  tibor_:grab
Sun Apr 2 16:23:44 2017  Michael-O:Unfortunately, the JAR isn't there. I have turned on debug on these ITs in the class.
Sun Apr 2 16:25:48 2017  tibor_:you think it is connected to classpth and not the jvm?
Sun Apr 2 16:26:48 2017  tibor_:The jvm crashed before first test?
Sun Apr 2 16:28:07 2017  Michael-O:No, is ran badplugin, extension sucessfully.
Sun Apr 2 16:28:19 2017  Michael-O:With the start of buildfailure-depmissing it failed.
Sun Apr 2 16:28:35 2017  Michael-O:[INFO] Error stacktraces are turned on.
Sun Apr 2 16:28:35 2017  Michael-O:[INFO] Scanning for projects...
Sun Apr 2 16:28:41 2017  Michael-O:that's it in the log file
Sun Apr 2 16:28:57 2017  khmarbaise:Joined the channel
Sun Apr 2 16:29:28 2017  tibor_:and you run which project? maven-integration-testing?
Sun Apr 2 16:29:35 2017  tibor_:only two lines in log?
Sun Apr 2 16:30:44 2017  Michael-O:Yes, two lines in the IT log. Running Core ITs from master with Maven MNG-6169/updated-MJAR
Sun Apr 2 16:30:55 2017  Michael-O:so the JARs produced inflight are broken
Sun Apr 2 16:31:06 2017  Michael-O:I need the manifest of Surefire....arggggg.
Sun Apr 2 16:31:54 2017  tibor_:in debug the classpath should be printed
Sun Apr 2 16:33:43 2017  Michael-O:I don't know wether the temporary booter JAR is broken or the deps
Sun Apr 2 16:33:50 2017  Michael-O:since the booter JAR is deleted
Sun Apr 2 16:39:31 2017  tibor_:Michael-O: Michael, I have to go, but my PC is running testing the ITs. I'll be back in an hour.
Sun Apr 2 16:44:30 2017  khmarbaise_:Joined the channel
Sun Apr 2 16:46:03 2017  Michael-O:ok
Sun Apr 2 16:46:06 2017  Michael-O:I will keep digging
Sun Apr 2 16:46:11 2017  Michael-O:something is really fishy here
Sun Apr 2 16:46:20 2017  Michael-O:khmarbaise, are you there?
Sun Apr 2 16:46:29 2017  khmarbaise:Hi ...yes
Sun Apr 2 16:47:24 2017  khmarbaise:Michael-O: yes..I’m here but not for dinner is on its way...
Sun Apr 2 16:47:26 2017  Michael-O:Hi, can you pull from Maven master and build MNG-6169/all-updated and MNG-6169/not-updated-MJAR-COMPILER and run our IT suite with -Prun-its,embedded
Sun Apr 2 16:47:53 2017  Michael-O:I have found several issues either in our IT suite or plugins
Sun Apr 2 16:48:47 2017  khmarbaise:I can take a look later …
Sun Apr 2 16:49:02 2017  khmarbaise:What does our CI server says…?
Sun Apr 2 16:51:14 2017  Michael-O:I haven't set up any jobs for the branches yet.
Sun Apr 2 16:51:27 2017  Michael-O:It fails on Windows 10 repeatedly as well as on FreeBSD 10.3
Sun Apr 2 16:51:35 2017  Michael-O:It must be something wrong with MJAR and MCOMPILER
Sun Apr 2 16:51:50 2017  Michael-O:I do even have segfaults with this MJAR version
Sun Apr 2 16:51:58 2017  Michael-O:ZipEntry failures in native code
Sun Apr 2 18:41:11 2017  Michael-O:tibor_, are you back?
Sun Apr 2 18:41:15 2017  tibor_:yes
Sun Apr 2 18:41:25 2017  Michael-O:I wrote a small Java program to read JAR files and consume entities
Sun Apr 2 18:41:27 2017  tibor_:I am reading your talks
Sun Apr 2 18:41:48 2017  Michael-O:Did it on the local repo as well as on all files on target. All is fine, no crash :-(
Sun Apr 2 18:46:24 2017  tibor_:I believe you should instal other than OpenJdk first and restart the tests.
Sun Apr 2 18:50:35 2017  Michael-O:I will try Java 7 in a few minutes
Sun Apr 2 18:52:48 2017  Michael-O:I reupdated the system today actually
Sun Apr 2 18:52:53 2017  Michael-O:maybe I broke something
Sun Apr 2 19:02:57 2017  Michael-O:reinstalled down to 112 from 121
Sun Apr 2 19:04:00 2017  Michael-O:tibor_, but guess what. I had similar issues with Java 7 and Tomcat 6 for on the fly compression.
Sun Apr 2 19:04:14 2017  Michael-O:I did not know how to reproduce. I disabled compression.
Sun Apr 2 19:04:47 2017  Michael-O:Unfortunately our tests are so highly integrated that an isolated reproduction is hard.
Sun Apr 2 19:09:25 2017  tibor_:git clone -b MNG-6169/all-updated https://git-wip-us.apache.org/repos/asf/maven-integration-testing.git
Sun Apr 2 19:09:35 2017  tibor_:fatal: Remote branch MNG-6169/all-updated not found in upstream origin
Sun Apr 2 19:11:14 2017  Michael-O:on maven.git
Sun Apr 2 19:11:24 2017  Michael-O:Build maven from and all IT master with that
Sun Apr 2 19:12:05 2017  tibor_:should I clone MNG-6169/not-updated-MJAR-COMPILER as well?
Sun Apr 2 19:12:28 2017  Michael-O:yes
Sun Apr 2 19:13:15 2017  Michael-O:Run tests with both distros
Sun Apr 2 19:14:04 2017  tibor_:fatal: Remote branch MNG-6169/not-updated-MJAR-COMPILER not found in upstream origin
Sun Apr 2 19:15:25 2017  Michael-O:https://git-wip-us.apache.org/repos/asf/maven.git
Sun Apr 2 19:15:37 2017  Michael-O:it's a change to maven, not core ITs
Sun Apr 2 19:16:28 2017  tibor_:git clone -b MNG-6169/not-updated-MJAR-COMPILER https://git-wip-us.apache.org/repos/asf/maven.git
Sun Apr 2 19:16:30 2017  tibor_:fatal
Sun Apr 2 19:16:37 2017  tibor_:typo?
Sun Apr 2 19:21:06 2017  Michael-O:This could be our issue: http://stackoverflow.com/a/1313777/696632
Sun Apr 2 19:21:15 2017  Michael-O:origin/MNG-6169/not-updated-MJAR-MCOMPILER
Sun Apr 2 19:22:10 2017  tibor_:[WARNING] The requested profile "embedded" could not be activated because it does not exist.
Sun Apr 2 19:24:12 2017  Michael-O: No, no. You have to build Maven fron that branch. Then use the bin distro to run the ITs in embedded mode.
Sun Apr 2 19:27:15 2017  tibor_:$ git status
Sun Apr 2 19:27:16 2017  tibor_:On branch MNG-6169/all-update
Sun Apr 2 19:27:27 2017  tibor_:mvn install -Prun-its,embedded -Dmaven.repo.local=./target/repo2
Sun Apr 2 19:27:33 2017  tibor_:Is this correct?
Sun Apr 2 19:27:58 2017  Michael-O:Almost:
Sun Apr 2 19:28:00 2017  Michael-O:cd maven
Sun Apr 2 19:28:10 2017  Michael-O:git checkout MNG-6169/all-updated
Sun Apr 2 19:28:13 2017  Michael-O:mvn clean package
Sun Apr 2 19:28:25 2017  Michael-O:cp apache-maven/target/apache-maven...tar.gz ~
Sun Apr 2 19:28:27 2017  Michael-O:cd
Sun Apr 2 19:28:35 2017  Michael-O:tar xzf apache-maven...tar.gz
Sun Apr 2 19:28:41 2017  Michael-O:cd maven-integration-testing
Sun Apr 2 19:29:58 2017  Michael-O:~/apache-maven-3.5.0-SNAPSHOT/bin/mvn clean install -Prun-its,embedded -Dmaven.repo.local=$(pwd)/repo
Sun Apr 2 19:48:25 2017  Michael-O:tibor_, good news. Our implementation really hit http://stackoverflow.com/a/21628611/696632
Sun Apr 2 19:50:54 2017  tibor_:why you dont have problem with rat-plugin if you create repo in pwd/repo?
Sun Apr 2 19:51:09 2017  tibor_:this should be another dir
Sun Apr 2 19:51:22 2017  Michael-O:do outside, I think there is an exclusion
Sun Apr 2 19:51:26 2017  tibor_:e.g. ./target/repo
Sun Apr 2 19:51:34 2017  Michael-O:../repo
Sun Apr 2 19:51:42 2017  tibor_:ok
Sun Apr 2 19:55:50 2017  tibor_:success
Sun Apr 2 19:56:07 2017  tibor_:E:\apache-maven-3.5.0-SNAPSHOT\bin\mvn install -Prun-its,embedded -Dmaven.repo.local=../repo
Sun Apr 2 19:58:19 2017  tibor_:Does it mean that we move open zip file?
Sun Apr 2 19:59:25 2017  Michael-O:Either move or change on the fly
Sun Apr 2 19:59:33 2017  Michael-O:Run at least three times
Sun Apr 2 19:59:44 2017  Michael-O:you should see at least one failure
Sun Apr 2 20:00:16 2017  tibor_:no error, fast build acctually 3 min
Sun Apr 2 20:01:06 2017  tibor_:maven.git
Sun Apr 2 20:02:47 2017  Michael-O:All ITs pass on maven-integration-testing.git?
Sun Apr 2 20:05:14 2017  tibor_:master in its?
Sun Apr 2 20:05:39 2017  Michael-O:Yes
Sun Apr 2 20:05:54 2017  Michael-O:cd maven-integration-testing.git
Sun Apr 2 20:05:59 2017  Michael-O:E:\apache-maven-3.5.0-SNAPSHOT\bin\mvn install -Prun-its,embedded -Dmaven.repo.local=../repo
Sun Apr 2 20:07:44 2017  Michael-O:I have now the JAR which is changes on the fly
Sun Apr 2 20:09:14 2017  Michael-O:Scanning URL: jar:file:/home/mosipov/Projekte/maven-integration-testing/repo/org/apache/maven/its/mng5640/lifecyclePa
Sun Apr 2 20:09:14 2017  Michael-O:rticipantAfterSession/mng-5640-lifecycleParticipant-afterSession-extension/0.1/mng-5640-lifecycleParticipant-afterSes
Sun Apr 2 20:09:14 2017  Michael-O:sion-extension-0.1.jar!/org/apache/maven/its/mng5640/lifecycleParticipantAfterSession/LifecycleParticipantImpl.class
Sun Apr 2 20:09:24 2017  Michael-O:then it crashes
Sun Apr 2 20:09:32 2017  Michael-O:Someone modified the jar
Sun Apr 2 20:15:42 2017  tibor_:running ITs..
Sun Apr 2 20:15:57 2017  tibor_:crash means sehfault?
Sun Apr 2 20:16:41 2017  tibor_:why somebody want's the archive to change?
Sun Apr 2 20:20:22 2017  Michael-O:I do not know yet but someone does
Sun Apr 2 20:22:43 2017  tibor_:I have received a lot of exceptions like this
Sun Apr 2 20:22:44 2017  tibor_:ArtifactNotFoundException: Failure to find org.apache.maven.its.plugins:maven-it-plugin-configuration:jar:2.1-SNAPSHOT in file:target/null was cached in the local repository, resolution will not be reattempted until the update interval of central has elapsed or updates are forced
Sun Apr 2 20:23:46 2017  Michael-O:rerun or create new repo
Sun Apr 2 20:23:49 2017  Michael-O:this is a known issue
Sun Apr 2 20:24:30 2017  tibor_:this would be okay?
Sun Apr 2 20:24:31 2017  tibor_:-Dmaven.repo.local=../repo2
Sun Apr 2 20:24:44 2017  Michael-O:yes
Sun Apr 2 20:29:26 2017  Michael-O:This will help: https://en.wikipedia.org/wiki/DTrace
Sun Apr 2 20:56:09 2017  khmarbaise:Left the channel
Sun Apr 2 21:10:35 2017  Michael-O:tibor_, I just scanned the dump file.
Sun Apr 2 21:10:48 2017  Michael-O:This is the problematic JAR: mng-5640-lifecycleParticipant-afterSession-extension-0.1.jar
Sun Apr 2 21:11:09 2017  Michael-O:I think that Mavne Plugin Tools modify the classes or JAR at runtime and make it fail
Sun Apr 2 21:12:26 2017  tibor_:You should uncover your findings in the ML.
Sun Apr 2 21:14:41 2017  Michael-O:I patched Sisu Inject to find the offending JAR file
Sun Apr 2 21:15:06 2017  Michael-O:IT happens then Classworlds builds the ExtRealm at Maven start
Sun Apr 2 21:56:20 2017  Michael-O:tibor_, are you familiar with inodes on Unix filesystems?
Sun Apr 2 23:01:55 2017  Michael-O:tibor_, are you still on?
Sun Apr 2 23:02:43 2017  Michael-O:I found the root cause

Comments